{"text_format":"1","workbook":"xlsx","n_sheets":12,"sheets":["Personal Lines P&C","Commercial Lines P&C","Income Generator","5 Year Summary","Agent Expense Budget","Capital Resources","Leads-Prospects Template","AAP Calculator","AAA-AAP Variables","Bonus","MacroDefaults","Sheet1"],"not_rendered":{"charts":0,"images":1,"macros":1,"external_links":0,"defined_names":6,"comments":0,"pivot_tables":0},"unopened":[],"bounds":{"document_bytes":16777216,"sheet_cells":100000,"rows_first":2000,"rows_last":500,"rows_between":2000,"halvings":0,"cell_chars":16384,"cell_head_chars":4096},"cells_cut":0,"cells_raw":0,"read":"whole","date_system":"1900"}

{"sheet":"Personal Lines P&C","index":0,"n_rows":41,"n_cols":9,"rows_kept":41,"cut":false,"hidden":false,"merged":[[38,0,38,1],[0,2,0,8]]}
["Product Type","Per Policy","New and Renewal Premiums and Commissions"]
[]
["PERSONAL LINES Products","Avg Prem. ea.","Year 1","Year 2","Year 3","Year 4","Year 5",null,"5 Year Cumm"]
["Auto"]
["Avg Annual Prem Per Unit",0]
["Avg # Auto Units Per Month",null,0,0,0,0,0,null,{"$f":"SUM(C6:G6)*12","v":0}]
["Commission %",null,{"$f":"HLOOKUP(AgentType,'AAA-AAP Variables'!$P$1:$Q$86,2,FALSE)","v":0.1},{"$f":"IF($C$7=HLOOKUP(AgentType,'AAA-AAP Variables'!$P$1:$Q$86,2,FALSE),HLOOKUP(AgentType,'AAA-AAP Variables'!$P$1:$Q$86,3,FALSE),$C$7)","v":0.1},{"$f":"IF($C$7=HLOOKUP(AgentType,'AAA-AAP Variables'!$P$1:$Q$86,2,FALSE),HLOOKUP(AgentType,'AAA-AAP Variables'!$P$1:$Q$86,4,FALSE),$C$7)","v":0.1},{"$f":"IF($C$7=HLOOKUP(AgentType,'AAA-AAP Variables'!$P$1:$Q$86,2,FALSE),HLOOKUP(AgentType,'AAA-AAP Variables'!$P$1:$Q$86,5,FALSE),$C$7)","v":0.1},{"$f":"IF($C$7=HLOOKUP(AgentType,'AAA-AAP Variables'!$P$1:$Q$86,2,FALSE),HLOOKUP(AgentType,'AAA-AAP Variables'!$P$1:$Q$86,6,FALSE),$C$7)","v":0.1},null,{"$f":"AVERAGE(C7:G7)","v":0.1}]
["Avg 1st Year Annual Persistency",null,0.9,{"$f":"C8","v":0.9},{"$f":"C8","v":0.9},{"$f":"C8","v":0.9},{"$f":"C8","v":0.9},null,{"$f":"AVERAGE(C8:G8)","v":0.9}]
["Avg Renewal Annual Persistency",null,0.9,{"$f":"C9","v":0.9},{"$f":"C9","v":0.9},{"$f":"C9","v":0.9},{"$f":"C9","v":0.9},null,{"$f":"AVERAGE(C9:G9)","v":0.9}]
["Total 1st Year Premium Collected",null,{"$f":"$B5*C6*12*C8","v":0},{"$f":"$B5*D6*12*D8","v":0},0,0,0,null,{"$f":"SUM(C10:G10)","v":0}]
["Total Renewal Premium Collected",null,null,{"$f":"C10*D9","v":0},{"$f":"(D10+D11)*E9","v":0},{"$f":"(E10+E11)*F9","v":0},{"$f":"(F10+F11)*G9","v":0},null,{"$f":"SUM(C11:G11)","v":0}]
["Annual Commission Paid $",null,{"$f":"C10*C7","v":0},{"$f":"D10*D7","v":0},{"$f":"E10*E7","v":0},{"$f":"F10*F7","v":0},{"$f":"G10*G7","v":0},null,{"$f":"SUM(C12:G12)","v":0}]
["Renewal Commission Paid $",null,0,{"$f":"D11*D7","v":0},{"$f":"E11*E7","v":0},{"$f":"F11*F7","v":0},{"$f":"G11*G7","v":0},null,{"$f":"SUM(C13:G13)","v":0}]
[]
["Homeowners"]
{"$rows_left_out":27}
{"sheet":"Commercial Lines P&C","index":1,"n_rows":73,"n_cols":9,"rows_kept":73,"cut":false,"hidden":false,"merged":[[70,0,70,1],[0,2,0,8]]}
["Product Type","Per Policy","New and Renewal Premiums and Commissions"]
["COMMERCIAL LINES Products","Avg Prem. ea.","Year 1","Year 2","Year 3","Year 4","Year 5",null,"5 Year Cumm"]
["Business Owner Policy"]
["Avg Annual Prem Per Policy",0]
["Avg # Policies Per Month",null,0,0,0,0,0,null,{"$f":"SUM(C5:G5)*12","v":0}]
["Commission %",null,{"$f":"HLOOKUP(AgentType,'AAA-AAP Variables'!$P$1:$Q$86,17,FALSE)","v":0.12},{"$f":"IF($C$6=HLOOKUP(AgentType,'AAA-AAP Variables'!$P$1:$Q$86,17,FALSE),HLOOKUP(AgentType,'AAA-AAP Variables'!$P$1:$Q$86,18,FALSE),$C$6)","v":0.12},{"$f":"IF($C$6=HLOOKUP(AgentType,'AAA-AAP Variables'!$P$1:$Q$86,17,FALSE),HLOOKUP(AgentType,'AAA-AAP Variables'!$P$1:$Q$86,19,FALSE),$C$6)","v":0.12},{"$f":"IF($C$6=HLOOKUP(AgentType,'AAA-AAP Variables'!$P$1:$Q$86,17,FALSE),HLOOKUP(AgentType,'AAA-AAP Variables'!$P$1:$Q$86,20,FALSE),$C$6)","v":0.12},{"$f":"IF($C$6=HLOOKUP(AgentType,'AAA-AAP Variables'!$P$1:$Q$86,17,FALSE),HLOOKUP(AgentType,'AAA-AAP Variables'!$P$1:$Q$86,21,FALSE),$C$6)","v":0.12},null,{"$f":"AVERAGE(C6:G6)","v":0.12}]
["Avg 1st Year Annual Persistency",null,0.9,{"$f":"C7","v":0.9},{"$f":"C7","v":0.9},{"$f":"C7","v":0.9},{"$f":"C7","v":0.9},null,{"$f":"AVERAGE(C7:G7)","v":0.9}]
["Avg Renewal Annual Persistency",null,0.9,{"$f":"C8","v":0.9},{"$f":"C8","v":0.9},{"$f":"C8","v":0.9},{"$f":"C8","v":0.9},null,{"$f":"AVERAGE(C8:G8)","v":0.9}]
["Total 1st Year Premium Collected",null,{"$f":"$B4*C5*12*C7","v":0},{"$f":"$B4*D5*12*D7","v":0},0,0,0,null,{"$f":"SUM(C9:G9)","v":0}]
["Total Renewal Premium Collected",null,null,{"$f":"C9*D8","v":0},{"$f":"(D9+D10)*E8","v":0},{"$f":"(E9+E10)*F8","v":0},{"$f":"(F9+F10)*G8","v":0},null,{"$f":"SUM(C10:G10)","v":0}]
["Annual Commission Paid $",null,{"$f":"C9*C6","v":0},{"$f":"D9*D6","v":0},{"$f":"E9*E6","v":0},{"$f":"F9*F6","v":0},{"$f":"G9*G6","v":0},null,{"$f":"SUM(C11:G11)","v":0}]
["Renewal Commission Paid $",null,0,{"$f":"D10*D6","v":0},{"$f":"E10*E6","v":0},{"$f":"F10*F6","v":0},{"$f":"G10*G6","v":0},null,{"$f":"SUM(C12:G12)","v":0}]
[]
["Business Auto"]
["Avg Annual Prem Per Auto",0]
{"$rows_left_out":59}
{"sheet":"Income Generator","index":2,"n_rows":165,"n_cols":13,"rows_kept":165,"cut":false,"hidden":false,"merged":[[59,12,72,12],[97,12,98,12],[139,12,140,12],[147,1,147,9],[100,1,100,2],[74,1,74,2],[141,1,141,2],[145,1,145,2],[142,1,142,2],[99,1,99,2],[1,7,1,9],[1,1,1,5],[33,1,33,2],[73,1,73,2],[34,1,34,2],[3,3,3,9],[148,1,148,9],[149,1,149,3],[149,4,149,6],[151,7,152,9],[151,1,152,1]]}
[]
[null,"Agency Plan",null,null,null,null,"Candidate",{"$f":"MacroDefaults!B1","v":"Mr./ Mrs. Agent"}]
[null,"NAME OF CANDIDATE",null,null,null,null,null,{"$f":"TODAY()","v":"2018-08-30"},null,"Page -1 of 2-"]
[null,"Product Type","Per Policy","New and Renewal Premiums and Commissions"]
[]
[null,"PERSONAL LINES PROPERTY and CASUALTY Products","Avg Prem. ea.","Year 1","Year 2","Year 3","Year 4","Year 5",null,"5 Year Cumm"]
[null,"Personal Auto Premium Summary",{"$f":"'Personal Lines P&C'!B5","v":0},{"$f":"SUM('Personal Lines P&C'!C10:C11)","v":0},{"$f":"SUM('Personal Lines P&C'!D10:D11)","v":0},{"$f":"SUM('Personal Lines P&C'!E10:E11)","v":0},{"$f":"SUM('Personal Lines P&C'!F10:F11)","v":0},{"$f":"SUM('Personal Lines P&C'!G10:G11)","v":0},null,{"$f":"SUM(D7:H7)","v":0}]
[null,"Personal Auto Commission Summary",null,{"$f":"'Personal Lines P&C'!C12+'Personal Lines P&C'!C13","v":0},{"$f":"SUM('Personal Lines P&C'!D12:D13)","v":0},{"$f":"SUM('Personal Lines P&C'!E12:E13)","v":0},{"$f":"SUM('Personal Lines P&C'!F12:F13)","v":0},{"$f":"SUM('Personal Lines P&C'!G12:G13)","v":0},null,{"$f":"SUM(D8:H8)","v":0}]
[null,"Personal Home Premium Summary",{"$f":"'Personal Lines P&C'!B16","v":0},{"$f":"SUM('Personal Lines P&C'!C21:C22)","v":0},{"$f":"SUM('Personal Lines P&C'!D21:D22)","v":0},{"$f":"SUM('Personal Lines P&C'!E21:E22)","v":0},{"$f":"SUM('Personal Lines P&C'!F21:F22)","v":0},{"$f":"SUM('Personal Lines P&C'!G21:G22)","v":0},null,{"$f":"SUM(D9:H9)","v":0}]
[null,"Personal Home Commission Summary",null,{"$f":"SUM('Personal Lines P&C'!C23:C24)","v":0},{"$f":"SUM('Personal Lines P&C'!D23:D24)","v":0},{"$f":"SUM('Personal Lines P&C'!E23:E24)","v":0},{"$f":"SUM('Personal Lines P&C'!F23:F24)","v":0},{"$f":"SUM('Personal Lines P&C'!G23:G24)","v":0},null,0]
[null,"Personal Umbrella Premium Summary",{"$f":"'Personal Lines P&C'!B27","v":0},{"$f":"SUM('Personal Lines P&C'!C32:C33)","v":0},{"$f":"SUM('Personal Lines P&C'!D32:D33)","v":0},{"$f":"SUM('Personal Lines P&C'!E32:E33)","v":0},{"$f":"SUM('Personal Lines P&C'!F32:F33)","v":0},{"$f":"SUM('Personal Lines P&C'!G32:G33)","v":0},null,0]
[null,"Personal Umbrella Commission Summary",null,{"$f":"SUM('Personal Lines P&C'!C34:C35)","v":0},{"$f":"SUM('Personal Lines P&C'!D34:D35)","v":0},{"$f":"SUM('Personal Lines P&C'!E34:E35)","v":0},{"$f":"SUM('Personal Lines P&C'!F34:F35)","v":0},{"$f":"SUM('Personal Lines P&C'!G34:G35)","v":0},null,0]
[null,null,null,null,null,null,null,null,null,0]
[null,"Personal Lines Premium Summary",null,{"$f":"D7+D9+D11","v":0},{"$f":"E7+E9+E11","v":0},0,0,0,null,0]
[null,"Personal Lines Commission Summary",null,{"$f":"D8+D10+D12","v":0},{"$f":"E8+E10+E12","v":0},0,0,0,null,0]
{"$rows_left_out":151}
{"sheet":"5 Year Summary","index":3,"n_rows":25,"n_cols":12,"rows_kept":25,"cut":false,"hidden":false,"merged":[[24,1,24,3],[24,4,24,6],[3,3,3,11],[1,9,1,11],[10,2,11,2],[12,2,13,2],[19,1,19,9],[21,1,22,1],[21,4,22,6],[1,1,1,5],[6,2,7,2],[8,2,9,2]]}
[]
[null,"Agency Plan",null,null,null,null,null,"Candidate",null,{"$f":"'Income Generator'!$H$2","v":"Mr./ Mrs. Agent"}]
[null,{"$f":"'Income Generator'!B3","v":"NAME OF CANDIDATE"},null,null,null,null,null,null,null,null,null,{"$f":"TODAY()","v":"2018-08-30"}]
[null,"Product Type","Per Policy","New and Renewal Premiums and Commissions"]
[]
[null,null,"Avg Prem. ea.","Year 1","Year 2","Year 3","Year 4","Year 5",null,"5 Year Cumm",null,"Annual Average"]
[null,{"$f":"'Income Generator'!B34:C34","v":"Total PROPERTY and CASUALTY Premium"},{"$f":"AVERAGE('Income Generator'!C7,'Income Generator'!C9,'Income Generator'!C11,'Income Generator'!C18,'Income Generator'!C20,'Income Generator'!C22,'Income Generator'!C24,'Income Generator'!C26,'Income Generator'!C28)","v":0},{"$f":"'Income Generator'!D34:E34","v":0},{"$f":"'Income Generator'!E34:F34","v":0},{"$f":"'Income Generator'!F34:G34","v":0},{"$f":"'Income Generator'!G34:H34","v":0},{"$f":"'Income Generator'!H34:I34","v":0},{"$f":"'Income Generator'!I34:J34","v":0},{"$f":"'Income Generator'!J34","v":0},null,{"$f":"J7/5","v":0}]
[null,{"$f":"'Income Generator'!B35:C35","v":"TOTAL PROPERTY and CASUALTY Est. Comp. Paid $"},null,{"$f":"'Income Generator'!D35:E35","v":0},{"$f":"'Income Generator'!E35:F35","v":0},{"$f":"'Income Generator'!F35:G35","v":0},{"$f":"'Income Generator'!G35:H35","v":0},{"$f":"'Income Generator'!H35:I35","v":0},{"$f":"'Income Generator'!I35:J35","v":0},{"$f":"'Income Generator'!J35","v":0},null,0]
[null,{"$f":"'Income Generator'!B74:C74","v":"Total LIFE Premium Collected"},{"$f":"AVERAGE('Income Generator'!C38,'Income Generator'!C50,'Income Generator'!C62)","v":0},{"$f":"'Income Generator'!D74","v":0},{"$f":"'Income Generator'!E74","v":0},{"$f":"'Income Generator'!F74","v":0},{"$f":"'Income Generator'!G74","v":0},{"$f":"'Income Generator'!H74","v":0},{"$f":"'Income Generator'!I74:J74","v":0},{"$f":"'Income Generator'!J74","v":0},null,0]
[null,{"$f":"'Income Generator'!B75:C75","v":"TOTAL LIFE Products Comp. Est. Paid $"},null,{"$f":"'Income Generator'!D75","v":0},{"$f":"'Income Generator'!E75","v":0},{"$f":"'Income Generator'!F75","v":0},{"$f":"'Income Generator'!G75","v":0},{"$f":"'Income Generator'!H75","v":0},{"$f":"'Income Generator'!I75:J75","v":0},{"$f":"'Income Generator'!J75","v":0},null,0]
[null,{"$f":"'Income Generator'!B100:C100","v":"Total ANNUITIES and PENSIONS Premium"},{"$f":"AVERAGE('Income Generator'!C78,'Income Generator'!C88)","v":0},{"$f":"'Income Generator'!D100:E100","v":0},{"$f":"'Income Generator'!E100:F100","v":0},{"$f":"'Income Generator'!F100:G100","v":0},{"$f":"'Income Generator'!G100:H100","v":0},{"$f":"'Income Generator'!H100:I100","v":0},{"$f":"'Income Generator'!I100:J100","v":0},{"$f":"'Income Generator'!J100","v":0},null,0]
[null,{"$f":"'Income Generator'!B101:C101","v":"TOTAL ANNUITIES and PENSIONS Est. Comp. Paid $"},null,{"$f":"'Income Generator'!D101:E101","v":0},{"$f":"'Income Generator'!E101:F101","v":0},{"$f":"'Income Generator'!F101:G101","v":0},{"$f":"'Income Generator'!G101:H101","v":0},{"$f":"'Income Generator'!H101:I101","v":0},{"$f":"'Income Generator'!I101:J101","v":0},{"$f":"'Income Generator'!J101","v":0},null,0]
[null,{"$f":"'Income Generator'!B142:C142","v":"Total Dis, LTC, Health Premium"},{"$f":"AVERAGE('Income Generator'!C106,'Income Generator'!C118,'Income Generator'!C130)","v":0},{"$f":"'Income Generator'!D142:E142","v":0},{"$f":"'Income Generator'!E142:F142","v":0},{"$f":"'Income Generator'!F142:G142","v":0},{"$f":"'Income Generator'!G142:H142","v":0},{"$f":"'Income Generator'!H142:I142","v":0},{"$f":"'Income Generator'!I142:J142","v":0},{"$f":"'Income Generator'!J142","v":0},null,0]
[null,{"$f":"'Income Generator'!B143:C143","v":"TOTAL Dis, LTC, Health Est. Comp. Paid $"},null,{"$f":"'Income Generator'!D143:E143","v":0},{"$f":"'Income Generator'!E143:F143","v":0},{"$f":"'Income Generator'!F143:G143","v":0},{"$f":"'Income Generator'!G143:H143","v":0},{"$f":"'Income Generator'!H143:I143","v":0},{"$f":"'Income Generator'!I143:J143","v":0},{"$f":"'Income Generator'!J143","v":0},null,0]
[]
{"$rows_left_out":11}
{"sheet":"Agent Expense Budget","index":4,"n_rows":85,"n_cols":17,"rows_kept":85,"cut":false,"hidden":false,"merged":[[1,1,1,15],[2,3,2,5],[78,3,78,14],[82,14,82,15],[79,1,79,2],[80,1,80,2]]}
[]
[null,"AGENT EXPENSE BUDGET WORKSHEET"]
[null,"                                    Candidate",{"$f":"'Income Generator'!$H$2","v":"Mr./ Mrs. Agent"},null,null,null,null,null,null,null,null,null,null,null,"Updated:",{"$f":"TODAY()","v":"2018-08-30"}]
[null,"Start Up Expenses","Description","Jan","Feb","Mar","Apr","May","Jun","Jul","Aug","Sep","Oct","Nov","Dec","Total"]
[]
[null,"Office  furniture and equip. ($3,000)","office desk, copy/fax, computer, phone, etc.",0,0,0,0,0,0,0,0,0,0,0,0,{"$f":"SUM(D6:O6)","v":0}]
[null,"Furn. and equip for PT team member","expense incurred in the 6th month",0,0,0,0,0,0,0,0,0,0,0,0,{"$f":"SUM(D7:O7)","v":0}]
[null,"Rent deposit","most offices require first months rent",0,0,0,0,0,0,0,0,0,0,0,0,0]
[null,"Signage not covered by company","window and vehicle labeling, excess sign exp., etc.",0,0,0,0,0,0,0,0,0,0,0,0,0]
[null,"Bus. License  and permits","state and local",0,0,0,0,0,0,0,0,0,0,0,0,0]
[null,"Bus. Insurance policy","BOP policy",0,0,0,0,0,0,0,0,0,0,0,0,0]
[null,"Other",null,0,0,0,0,0,0,0,0,0,0,0,0,0]
[null,"Other",null,0,0,0,0,0,0,0,0,0,0,0,0,0]
[null,"Other",null,0,0,0,0,0,0,0,0,0,0,0,0,0]
[null,"Other",null,0,0,0,0,0,0,0,0,0,0,0,0,0]
{"$rows_left_out":71}
{"sheet":"Capital Resources","index":5,"n_rows":28,"n_cols":8,"rows_kept":28,"cut":false,"hidden":false,"merged":[[1,7,1,8],[3,5,3,7],[21,4,21,8],[23,4,23,8],[27,7,27,8],[25,4,25,8],[7,2,7,4],[5,1,5,8]]}
[]
[null,"Additional Capital Resources",null,null,null,null,null,{"$f":"TODAY()","v":"2018-08-30"}]
[]
[null,null,null,null,"Candidate",{"$f":"'Income Generator'!$H$2","v":"Mr./ Mrs. Agent"}]
[]
[null,"In order to be successful as an independent contractor/agent you will need to  have sufficient resources to meet both your business expenses and your personal expenses.  Your anticipated business and personal expenses will likely result in a negative cash flow during the early years of operating an agency.  Below are lists of potential sources of capital that you may wish to explore."]
[]
[null,null,"Potential Sources of Capital",null,null,"$ Amount"]
[]
[null,null,"1-",null,"Personal Savings",0]
[null,null,"2-",null,"Loans from Family Member",0]
[null,null,"3-",null,"Personal Loans",0]
[null,null,"4-",null,"Anticipated Tax Return(s)",0]
[null,null,"5-",null,"Investments",0]
[null,null,"6-",null,"Other *\n(e.g. Small Business Association Loans, Family Gifts, etc.)",0]
{"$rows_left_out":14}
{"sheet":"Leads-Prospects Template","index":6,"n_rows":24,"n_cols":13,"rows_kept":24,"cut":false,"hidden":false,"merged":[[23,4,23,10],[24,4,24,10],[25,4,25,10],[26,4,26,10],[0,2,0,8],[2,2,3,2],[2,10,3,10],[21,9,21,10],[1,7,1,8],[0,10,0,12],[1,9,1,11],[27,4,27,10],[28,4,28,10],[29,4,29,10],[30,4,30,10],[31,4,31,10]]}
[null,null,"Annual Leads/Prospects Template ",null,null,null,null,null,null,null,{"$f":"TODAY()","v":"2018-08-30"}]
[null,null,null,null,null,null,null,"                       Candidate",null,{"$f":"'Income Generator'!H2","v":"Mr./ Mrs. Agent"}]
[null,null,"SOURCE","P/L","Life","Ag/Comm","Health","SM&R","Other","Other","TOTAL",null,"Monthly"]
[null,null,null,"Leads","Leads","Leads","Leads","Leads","Leads 1","Leads 2",null,null,"Average"]
[null,null,"Minimum Needed:",0,0,0,0,0,0,0,{"$f":"SUM(D5:J5)","v":0},null,{"$f":"K5/12","v":0}]
[null,"1-","Internet/Social Media ",0,0,0,0,0,0,0,{"$f":"SUM(D6:J6)","v":0},null,{"$f":"K6/12","v":0}]
[null,"2-","Family/Friends",0,0,0,0,0,0,0,0,null,0]
[null,"3-","Purchased Leads",0,0,0,0,0,0,0,0,null,0]
[null,"4-","Cold Calls Personal Lines",0,0,0,0,0,0,0,0,null,0]
[null,"5-","Cold Calls Business",0,0,0,0,0,0,0,0,null,0]
[null,"6-","Referrals",0,0,0,0,0,0,0,0,null,0]
[null,"7-","Associations",0,0,0,0,0,0,0,0,null,0]
[null,"8-","Real Estate",0,0,0,0,0,0,0,0,null,0]
[null,"9-","Other Source 1",0,0,0,0,0,0,0,0,null,0]
[null,"10-","Other Source 2",0,0,0,0,0,0,0,0,null,0]
{"$rows_left_out":10}
{"sheet":"AAP Calculator","index":7,"n_rows":53,"n_cols":8,"rows_kept":53,"cut":false,"hidden":true,"merged":[[2,4,2,5],[1,1,1,5],[26,1,29,1]]}
[]
[null,"AMERICAN NATIONAL - Agency Plan"]
[null,null,null,null,{"$f":"MacroDefaults!B1","v":"Mr./ Mrs. Agent"}]
[null,null,null,null,"I.  Agent Allowance Program (AAP) Calculator"]
[]
[null,null,null,"Input \nCells","Monthly \nAdvance","Annual \nAdvance"]
[]
[null,"*P&C Annual Advance Level ",null,8700,{"$f":"D8/12","v":725},{"$f":"D8","v":8700}]
[null,"**Life Annual Advance Level",null,20000,{"$f":"D9/12","v":1666.6666666666667},{"$f":"D9","v":20000}]
[]
[null,"Additional Bonus",null,0,{"$f":"D11/12","v":0},{"$f":"D11","v":0}]
[]
[null,"AGENT ADVANCE",null,null,{"$f":"SUM(E8:E11)","v":2391.666666666667},{"$f":"E13*12","v":28700.000000000004},"/yr."]
[]
[null,null,null,"Month","Cumulative P&C Validation ","Monthly P&C Validation","Cumulative Life Validation","Monthly Life Validation"]
{"$rows_left_out":39}
{"sheet":"AAA-AAP Variables","index":8,"n_rows":86,"n_cols":17,"rows_kept":86,"cut":false,"hidden":true,"merged":[]}
["P&C Income Levels",0,8700,12500,17500,20000,22000,25000,null,null,null,null,null,"Commissions","Year","AAA","AAP"]
["Life Income Levels",0,17500,20000,22000,25000,null,null,null,null,null,null,null,"Auto",1,0.1,0.08]
[null,null,null,null,null,null,null,null,null,null,null,null,null,null,2,0.1,0.08]
["Honor Roll Bonus",20,30,40,50,null,null,null,null,null,null,null,null,null,3,0.1,0.08]
["Life Production",2000,3000,4000,5000,null,null,null,null,null,null,null,null,null,4,0.1,0.08]
["Bonus Amount",1000,1500,2000,2500,null,null,null,null,null,null,null,null,null,5,0.1,0.08]
[null,null,null,null,null,null,null,null,null,null,null,null,null,"Homeowners",1,0.12,0.15]
[null,"qualifying rule:","option 1","option 2",null,null,null,null,null,null,null,null,null,null,2,0.12,0.15]
[null,{"$f":"#REF!","v":{"$error":"#REF!"}},{"$f":"IFERROR(HLOOKUP(B9,B4:E6,3),0)","v":0},{"$f":"IFERROR(HLOOKUP(ROUNDDOWN(B10/200,0)+B9,B4:E6,3),0)","v":0},"bonus lookup based on p&c",null,null,null,null,null,null,null,null,null,3,0.12,0.15]
[null,{"$f":"#REF!","v":{"$error":"#REF!"}},{"$f":"IFERROR(HLOOKUP(B10,B5:E6,2),0)","v":0},{"$f":"C10","v":0},"life production in excess of target",null,null,null,null,null,null,null,null,null,4,0.12,0.18]
[null,null,{"$f":"MIN(C9:C10)","v":0},{"$f":"MIN(D9:D10)","v":0},"CALCULATED Bonus",null,null,null,null,null,null,null,null,null,5,0.12,0.18]
[null,null," ",null,null,null,null,null,null,null,null,null,null,"Umbrella",1,0.105,0.09]
[null,null,null,null,null,null,null,null,null,null,null,null,null,null,2,0.105,0.09]
[null,null,null,null,null,null,null,null,null,null,null,null,null,null,3,0.105,0.09]
["P&C",8700,12500,17500,20000,22000,25000,"Life",17500,20000,22000,25000,null,null,4,0.105,0.09]
{"$rows_left_out":72}
{"sheet":"Bonus","index":9,"n_rows":60,"n_cols":13,"rows_kept":60,"cut":false,"hidden":true,"merged":[]}
["Honor Roll Bonus",20,30,40,50]
["Life Production",2000,3000,4000,5000]
["Bonus Amount",1000,1500,2000,2500]
[]
["Option 1",null,null,null,null,null,null,"Option 2"]
[]
["no growth, no attrition",null,null,null,null,null,null,"no growth, no attrition"]
[]
[null,null,"bonus using",null,"bonus using",null,null,null,null,"bonus using",null,"bonus using"]
["Year","P&C units","P&C units","life sales","life sales","HRB",null,"Year","P&C units","P&C units","life sales","life sales","HRB"]
[1,{"$f":"#REF!","v":{"$error":"#REF!"}},{"$f":"IFERROR(HLOOKUP(B11,$B$1:$E$3,3),0)","v":0},{"$f":"#REF!","v":{"$error":"#REF!"}},{"$f":"IFERROR(HLOOKUP(D11,$B$2:$E$3,2),0)","v":0},{"$f":"MIN(C11,E11)","v":0},null,1,{"$f":"B11","v":{"$error":"#REF!"}},{"$f":"IFERROR(HLOOKUP(I11+ROUNDDOWN(K11/200,0),$B$1:$E$3,3),0)","v":0},{"$f":"D11","v":{"$error":"#REF!"}},{"$f":"IFERROR(HLOOKUP(K11,$B$2:$E$3,2),0)","v":0},{"$f":"MIN(J11,L11)","v":0}]
[2,{"$f":"B11","v":{"$error":"#REF!"}},{"$f":"IFERROR(HLOOKUP(B12,$B$1:$E$3,3),0)","v":0},{"$f":"D11","v":{"$error":"#REF!"}},{"$f":"IFERROR(HLOOKUP(D12,$B$2:$E$3,2),0)","v":0},{"$f":"MIN(C12,E12)","v":0},null,2,{"$f":"B12","v":{"$error":"#REF!"}},{"$f":"IFERROR(HLOOKUP(I12+ROUNDDOWN(K12/200,0),$B$1:$E$3,3),0)","v":0},{"$f":"D12","v":{"$error":"#REF!"}},{"$f":"IFERROR(HLOOKUP(K12,$B$2:$E$3,2),0)","v":0},{"$f":"MIN(J12,L12)","v":0}]
[3,{"$f":"B11","v":{"$error":"#REF!"}},{"$f":"IFERROR(HLOOKUP(B13,$B$1:$E$3,3),0)","v":0},{"$f":"D11","v":{"$error":"#REF!"}},{"$f":"IFERROR(HLOOKUP(D13,$B$2:$E$3,2),0)","v":0},{"$f":"MIN(C13,E13)","v":0},null,3,{"$f":"B13","v":{"$error":"#REF!"}},{"$f":"IFERROR(HLOOKUP(I13+ROUNDDOWN(K13/200,0),$B$1:$E$3,3),0)","v":0},{"$f":"D13","v":{"$error":"#REF!"}},{"$f":"IFERROR(HLOOKUP(K13,$B$2:$E$3,2),0)","v":0},{"$f":"MIN(J13,L13)","v":0}]
[]
["no growth, with attrition",null,null,null,null,null,null,"no growth, with attrition"]
{"$rows_left_out":46}
{"sheet":"MacroDefaults","index":10,"n_rows":2,"n_cols":2,"rows_kept":2,"cut":false,"hidden":true,"merged":[]}
["Name:","Mr./ Mrs. Agent"]
["Agent Type:","AAA"]

{"sheet":"Sheet1","index":11,"n_rows":0,"n_cols":0,"rows_kept":0,"cut":false,"hidden":false,"merged":[]}